{"text_format":"1","workbook":"xlsx","n_sheets":18,"sheets":["Configuration","Guidance BS","Guidance FFS","Information on Beneficiary","ADM COSTS","Subcontracting_Template","Subcontracting","Consumer","Construction","Industry","Retail Trade","Services","Total","Sheet1","Calculation Methodology BS","Calculation Methodology FFS","Calculation Overview","Calculation Balance"],"not_rendered":{"charts":0,"images":0,"macros":1,"external_links":0,"defined_names":80,"comments":7,"pivot_tables":0},"unopened":[],"bounds":{"document_bytes":16777216,"sheet_cells":100000,"rows_first":2000,"rows_last":500,"rows_between":2000,"halvings":0,"cell_chars":16384,"cell_head_chars":4096},"cells_cut":0,"cells_raw":0,"read":"whole","date_system":"1900"}

{"sheet":"Configuration","index":0,"n_rows":7,"n_cols":3,"rows_kept":7,"cut":false,"hidden":true,"merged":[]}
["Heading line 1:","BUDGET AND FINAL FINANCIAL STATEMENT FOR GRANT AGREEMENT PERIOD MAY 2023 - APRIL 2024","BUDGET AND FINAL FINANCIAL STATEMENT FOR GRANT AGREEMENT PERIOD MAY 2023 - APRIL year 2023"]
["Heading line 2:","ANNEX V OF THE FRAMEWORK PARTNERSHIP AGREEMENT","ANNEX V OF THE FRAMEWORK PARTNERSHIP AGREEMENT"]
["Heading line 3:","ANNEX II OF THE SPECIFIC GRANT AGREEMENT","ANNEX II OF THE SPECIFIC GRANT AGREEMENT"]
["Heading line 4:","FINANCING PLAN AND COSTS OF THE SURVEYS","FINANCING PLAN AND COSTS OF THE SURVEYS"]
["Heading line 5:","(see Framework partnership agreement: Article II.19 on Eligible costs)","(see Framework partnership agreement: Article II.19 on Eligible costs)"]
["Status:","BUDGET","BUDGET"]
["Grant agreement:","ECFIN/XXX/2023/000000","ECFIN/XXX/2023/000000"]

{"sheet":"Guidance BS","index":1,"n_rows":58,"n_cols":2,"rows_kept":58,"cut":false,"hidden":false,"merged":[[34,0,34,1],[32,0,32,1],[0,0,0,1],[13,0,13,1],[15,0,15,1],[20,0,20,1],[30,0,30,1],[22,0,23,0],[27,0,28,0],[43,0,43,1],[56,0,56,1],[57,0,57,1],[44,0,44,1],[47,0,47,1],[45,0,45,1],[49,0,49,1],[54,0,54,1],[46,0,46,1],[48,0,48,1]]}
["MODEL BUDGET & FINANCIAL STATEMENT\nANNEX V TO THE FRAMEWORK PARTNERSHIP AGREEMENT"]
[null,"Some guidance on how to fill out the Budget Statement (BS)"]
["Dear Madam/Sir,"]
["This is a template that you must use to submit the budget statement for the grant agreement."]
["When you open this file, a warning message might appear informing you that macros have been disabled. Please click on 'Enable' in order to enable the macros. "]
["Here are the basic features of this model :"]
["(un)locked cells : ","only the white parts can be used freely by you "]
["Comments :","when you point the cursor on a cell with a red triangle, comments will appear with guidance"]
{"$rows_left_out":51}
{"sheet":"Guidance FFS","index":2,"n_rows":62,"n_cols":2,"rows_kept":62,"cut":false,"hidden":true,"merged":[[0,0,0,1],[13,0,13,1],[16,0,16,1],[22,0,22,1],[25,0,25,1],[23,0,23,1],[24,0,24,1],[61,0,61,1],[40,0,40,1],[28,0,28,1],[29,0,29,1],[54,0,54,1],[57,0,57,1],[60,0,60,1],[41,0,41,1],[45,0,45,1],[47,0,47,1],[46,0,46,1],[43,0,43,1],[26,0,26,1],[48,0,48,1],[49,0,49,1],[42,0,42,1],[36,0,36,1],[34,0,34,1],[38,0,38,1],[39,0,39,1],[35,0,35,1],[37,0,37,1],[44,0,44,1]]}
["MODEL BUDGET & FINANCIAL STATEMENT \nANNEX V TO THE FRAMEWORK PARTNERSHIP AGREEMENT"]
[null,"Some guidance on how to fill out the final financial statement (FFS)"]
["Dear Madam/Sir,"]
["This is a template you can use to submit the final financial statement for the grant agreement."]
["Here are the basic features of this model :"]
["(un)locked cells : ","only the white parts can be used freely by you "]
["Budget statement:","the information mentioned in the budget statement must not be changed. These cells should be frozen."]
["Comments :","when you point the cursor on a cell with a red triangle, comments will appear with guidance"]
{"$rows_left_out":55}
{"sheet":"Information on Beneficiary","index":3,"n_rows":21,"n_cols":2,"rows_kept":21,"cut":false,"hidden":false,"merged":[[0,0,0,1]]}
["Information on the beneficiary of the grant"]
[{"$f":"IF(NOT(ISBLANK('Guidance BS'!B10)),'Guidance BS'!B10,\"\")","v":"Country"},{"$f":"IF(NOT(ISBLANK('Guidance BS'!B12)),'Guidance BS'!B12,\"\")","v":"Acronym institution"}]
[null,"Please fill in all the information as requested below."]
[null,"please indicate: the title (Ms/Mrs/Mr), the last name, the first name and the function (Director, President, etc.) of the legal representative of your institution."]
["signing person  :","title (Ms/Mrs/Mr), LAST NAME, first name and function"]
["(page 1 of the agreement)"]
[null,"please indicate: the title (Ms/Mrs/Mr), the last name, the first name and the function (Director, President, etc.)"]
["second signing person* :","title (Ms/Mrs/Mr), LAST NAME, first name and function of 2nd signing person"]
{"$rows_left_out":14}
{"sheet":"ADM COSTS","index":4,"n_rows":54,"n_cols":13,"rows_kept":54,"cut":false,"hidden":true,"merged":[[54,1,54,4],[50,0,50,3],[0,0,0,1],[0,2,0,4],[1,0,1,4],[2,0,2,4],[3,0,3,4],[18,0,18,4],[40,0,40,3],[7,0,7,3],[19,0,19,3],[4,0,4,1],[53,1,53,4],[29,0,29,3],[32,0,32,3],[52,1,52,4],[45,0,45,3],[35,0,35,3],[17,0,17,3],[51,1,51,4],[12,6,12,12],[7,6,7,12],[28,6,28,11],[23,0,23,3],[26,0,26,3],[12,0,12,3],[17,6,17,12]]}
[{"$f":"Configuration!B7","v":"ECFIN/XXX/2023/000000"}]
["MODEL OF DETAILED LIST OF THE ELIGIBLE ADMINISTRATIVE COSTS"]
["Model of detailed list of eligible administrative costs to be submitted together with the final financial statements                  "]
["If applicable, please clearly identify costs by affiliated entities and/or co-beneficiaries"]
[null,null,"Conversion rate:\nAverage rate over the action period",1,"ACTUAL COSTS"]
["Invoice number (2)","Date of invoice","Subject/description of  invoice","Total amount of invoice (local currency)\n_______ (3)","Eligible cost in EUR"]
[2013005,"15/05/YY","Database provision & maintenance",1500,{"$f":"D7*$D$5","v":1500}]
["II.1 SUBCONTRACTING COSTS",null,null,null,{"$f":"SUM(E9:E13)-E13","v":0},null,"SUBCONTRACTING COSTS - DISTRIBUTION AMONG SURVEYS"]
{"$rows_left_out":47}
{"sheet":"Subcontracting_Template","index":5,"n_rows":22,"n_cols":1,"rows_kept":22,"cut":false,"hidden":true,"merged":[]}
["Information on subcontracting / contracts for implementing part of the action"]
[{"$f":"IF(NOT(ISBLANK('Guidance BS'!B12)),'Guidance BS'!B12,\"\")","v":"Acronym institution"}]
["Contracts must be awarded to the tender offering best value for money, that is to say, to the tender offering the best price-quality ratio, in compliance with the principles of transparency and equal treatment for potential contractors. Care must also be taken to avoid any conflict of interest. The eligibility of the costs for subcontracting is described in the Articles II.10 and II.11 of the Framework partnership agreement."]
["The information below must be given for each contract covering a heading or sub-heading of the costs of the action concerned:"]
["A copy of the signed contract should be enclosed. Please keep records and documentation of the selection process,"]
["Please fill in all sections."]
["·        Contractor’s official name :"]
[]
{"$rows_left_out":15}
{"sheet":"Subcontracting","index":6,"n_rows":22,"n_cols":1,"rows_kept":22,"cut":false,"hidden":false,"merged":[]}
["Information on subcontracting / contracts for implementing part of the action"]
[{"$f":"IF(NOT(ISBLANK('Guidance BS'!B12)),'Guidance BS'!B12,\"\")","v":"Acronym institution"}]
["Contracts must be awarded to the tender offering best value for money, that is to say, to the tender offering the best price-quality ratio, in compliance with the principles of transparency and equal treatment for potential contractors. Care must also be taken to avoid any conflict of interest. The eligibility of the costs for subcontracting is described in the Articles II.10 and II.11 of the Framework partnership agreement."]
["The information below must be given for each contract covering a heading or sub-heading of the costs of the action concerned:"]
["A copy of the signed contract should be enclosed. Please keep records and documentation of the selection process,"]
["Please fill in all sections."]
["·        Contractor’s official name :"]
[]
{"$rows_left_out":15}
{"sheet":"Consumer","index":7,"n_rows":66,"n_cols":13,"rows_kept":66,"cut":false,"hidden":false,"merged":[[67,4,67,12],[62,9,62,11],[65,4,65,7],[65,9,65,11],[63,4,63,7],[15,9,15,11],[45,9,45,11],[45,4,45,7],[48,9,48,11],[23,9,23,11],[16,9,16,11],[36,9,36,11],[34,9,34,11],[32,9,32,11],[23,5,23,7],[24,5,24,7],[26,5,26,7],[28,5,28,7],[32,5,32,7],[30,5,30,7],[15,4,15,7],[59,3,59,4],[58,3,58,4],[49,3,49,4],[51,3,51,4],[53,3,53,4],[54,3,54,4],[56,3,56,4],[57,3,57,4],[55,3,55,4],[60,3,60,4],[63,9,63,11],[18,5,18,8],[16,4,16,7],[18,3,18,4],[18,9,18,12],[34,5,34,7],[42,4,42,7],[26,9,26,11],[24,9,24,11],[46,3,46,8],[19,9,19,11],[30,9,30,11],[28,9,28,11],[62,3,62,7],[46,9,46,11],[10,9,10,11],[11,9,11,11],[0,2,0,12],[1,2,1,12],[3,2,3,12],[4,2,4,12],[5,2,5,12],[10,4,10,7],[11,4,11,7],[8,5,8,8],[8,9,8,12],[9,9,9,11],[9,4,9,7],[2,2,2,12],[23,19,23,22],[19,3,20,3],[23,14,23,18],[20,9,20,11],[21,9,21,11],[19,4,19,7],[20,4,20,7],[21,4,21,7],[13,9,13,11],[14,9,14,11],[12,4,12,7],[13,4,13,7],[14,4,14,7],[12,9,12,11]]}
[null,null,{"$f":"Configuration!B1","v":"BUDGET AND FINAL FINANCIAL STATEMENT FOR GRANT AGREEMENT PERIOD MAY 2023 - APRIL 2024"}]
[false,null,{"$f":"Configuration!B2","v":"ANNEX V OF THE FRAMEWORK PARTNERSHIP AGREEMENT"}]
[null,null,{"$f":"Configuration!B3","v":"ANNEX II OF THE SPECIFIC GRANT AGREEMENT"}]
[null,null,{"$f":"Configuration!B4","v":"FINANCING PLAN AND COSTS OF THE SURVEYS"}]
[null,null,{"$f":"Configuration!B5","v":"(see Framework partnership agreement: Article II.19 on Eligible costs)"}]
[null,null,{"$f":"Configuration!B7","v":"ECFIN/XXX/2023/000000"}]
[null,null,null,"INSTITUTION:",{"$f":"'Guidance BS'!B10","v":"Country"},{"$f":"'Guidance BS'!B12","v":"Acronym institution"}]
[null,null,null,"SURVEYS:","Consumer"]
{"$rows_left_out":59}
{"sheet":"Construction","index":8,"n_rows":66,"n_cols":13,"rows_kept":66,"cut":false,"hidden":false,"merged":[[65,4,65,7],[65,9,65,11],[56,3,56,4],[57,3,57,4],[58,3,58,4],[59,3,59,4],[60,3,60,4],[62,3,62,7],[62,9,62,11],[63,4,63,7],[63,9,63,11],[55,3,55,4],[36,9,36,11],[42,4,42,7],[45,4,45,7],[45,9,45,11],[46,3,46,8],[48,9,48,11],[49,3,49,4],[51,3,51,4],[53,3,53,4],[54,3,54,4],[46,9,46,11],[30,5,30,7],[30,9,30,11],[32,5,32,7],[32,9,32,11],[34,5,34,7],[34,9,34,11],[24,5,24,7],[24,9,24,11],[26,5,26,7],[26,9,26,11],[28,5,28,7],[28,9,28,11],[23,20,23,23],[18,3,18,4],[18,5,18,8],[18,9,18,12],[19,3,20,3],[19,4,19,7],[19,9,19,11],[20,4,20,7],[20,9,20,11],[21,4,21,7],[21,9,21,11],[23,5,23,7],[23,9,23,11],[23,15,23,19],[14,4,14,7],[14,9,14,11],[15,4,15,7],[15,9,15,11],[16,4,16,7],[16,9,16,11],[11,4,11,7],[11,9,11,11],[12,4,12,7],[12,9,12,11],[13,4,13,7],[13,9,13,11],[8,5,8,8],[8,9,8,12],[9,4,9,7],[9,9,9,11],[10,4,10,7],[10,9,10,11],[5,2,5,12],[0,2,0,12],[1,2,1,12],[2,2,2,12],[3,2,3,12],[4,2,4,12]]}
[null,null,{"$f":"Configuration!B1","v":"BUDGET AND FINAL FINANCIAL STATEMENT FOR GRANT AGREEMENT PERIOD MAY 2023 - APRIL 2024"}]
[false,null,{"$f":"Configuration!B2","v":"ANNEX V OF THE FRAMEWORK PARTNERSHIP AGREEMENT"}]
[null,null,{"$f":"Configuration!B3","v":"ANNEX II OF THE SPECIFIC GRANT AGREEMENT"}]
[null,null,{"$f":"Configuration!B4","v":"FINANCING PLAN AND COSTS OF THE SURVEYS"}]
[null,null,{"$f":"Configuration!B5","v":"(see Framework partnership agreement: Article II.19 on Eligible costs)"}]
[null,null,{"$f":"Configuration!B7","v":"ECFIN/XXX/2023/000000"}]
[null,null,null,"INSTITUTION:",{"$f":"'Guidance BS'!B10","v":"Country"},{"$f":"'Guidance BS'!B12","v":"Acronym institution"}]
[null,null,null,"SURVEYS:","Construction"]
{"$rows_left_out":59}
{"sheet":"Industry","index":9,"n_rows":66,"n_cols":13,"rows_kept":66,"cut":false,"hidden":false,"merged":[[65,4,65,7],[65,9,65,11],[56,3,56,4],[57,3,57,4],[58,3,58,4],[59,3,59,4],[60,3,60,4],[62,3,62,7],[62,9,62,11],[63,4,63,7],[63,9,63,11],[55,3,55,4],[36,9,36,11],[42,4,42,7],[45,4,45,7],[45,9,45,11],[46,3,46,8],[48,9,48,11],[49,3,49,4],[51,3,51,4],[53,3,53,4],[54,3,54,4],[46,9,46,11],[30,5,30,7],[30,9,30,11],[32,5,32,7],[32,9,32,11],[34,5,34,7],[34,9,34,11],[24,5,24,7],[24,9,24,11],[26,5,26,7],[26,9,26,11],[28,5,28,7],[28,9,28,11],[23,20,23,23],[18,3,18,4],[18,5,18,8],[18,9,18,12],[19,3,20,3],[19,4,19,7],[19,9,19,11],[20,4,20,7],[20,9,20,11],[21,4,21,7],[21,9,21,11],[23,5,23,7],[23,9,23,11],[23,15,23,19],[14,4,14,7],[14,9,14,11],[15,4,15,7],[15,9,15,11],[16,4,16,7],[16,9,16,11],[11,4,11,7],[11,9,11,11],[12,4,12,7],[12,9,12,11],[13,4,13,7],[13,9,13,11],[8,5,8,8],[8,9,8,12],[9,4,9,7],[9,9,9,11],[10,4,10,7],[10,9,10,11],[5,2,5,12],[0,2,0,12],[1,2,1,12],[2,2,2,12],[3,2,3,12],[4,2,4,12]]}
[null,null,{"$f":"Configuration!B1","v":"BUDGET AND FINAL FINANCIAL STATEMENT FOR GRANT AGREEMENT PERIOD MAY 2023 - APRIL 2024"}]
[true,null,{"$f":"Configuration!B2","v":"ANNEX V OF THE FRAMEWORK PARTNERSHIP AGREEMENT"}]
[null,null,{"$f":"Configuration!B3","v":"ANNEX II OF THE SPECIFIC GRANT AGREEMENT"}]
[null,null,{"$f":"Configuration!B4","v":"FINANCING PLAN AND COSTS OF THE SURVEYS"}]
[null,null,{"$f":"Configuration!B5","v":"(see Framework partnership agreement: Article II.19 on Eligible costs)"}]
[null,null,{"$f":"Configuration!B7","v":"ECFIN/XXX/2023/000000"}]
[null,null,null,"INSTITUTION:",{"$f":"'Guidance BS'!B10","v":"Country"},{"$f":"'Guidance BS'!B12","v":"Acronym institution"}]
[null,null,null,"SURVEYS:","Industry"]
{"$rows_left_out":59}
{"sheet":"Retail Trade","index":10,"n_rows":66,"n_cols":13,"rows_kept":66,"cut":false,"hidden":false,"merged":[[65,4,65,7],[65,9,65,11],[56,3,56,4],[57,3,57,4],[58,3,58,4],[59,3,59,4],[60,3,60,4],[62,3,62,7],[62,9,62,11],[63,4,63,7],[63,9,63,11],[55,3,55,4],[36,9,36,11],[42,4,42,7],[45,4,45,7],[45,9,45,11],[46,3,46,8],[48,9,48,11],[49,3,49,4],[51,3,51,4],[53,3,53,4],[54,3,54,4],[46,9,46,11],[30,5,30,7],[30,9,30,11],[32,5,32,7],[32,9,32,11],[34,5,34,7],[34,9,34,11],[24,5,24,7],[24,9,24,11],[26,5,26,7],[26,9,26,11],[28,5,28,7],[28,9,28,11],[23,20,23,23],[18,3,18,4],[18,5,18,8],[18,9,18,12],[19,3,20,3],[19,4,19,7],[19,9,19,11],[20,4,20,7],[20,9,20,11],[21,4,21,7],[21,9,21,11],[23,5,23,7],[23,9,23,11],[23,15,23,19],[14,4,14,7],[14,9,14,11],[15,4,15,7],[15,9,15,11],[16,4,16,7],[16,9,16,11],[11,4,11,7],[11,9,11,11],[12,4,12,7],[12,9,12,11],[13,4,13,7],[13,9,13,11],[8,5,8,8],[8,9,8,12],[9,4,9,7],[9,9,9,11],[10,4,10,7],[10,9,10,11],[5,2,5,12],[0,2,0,12],[1,2,1,12],[2,2,2,12],[3,2,3,12],[4,2,4,12]]}
[null,null,{"$f":"Configuration!B1","v":"BUDGET AND FINAL FINANCIAL STATEMENT FOR GRANT AGREEMENT PERIOD MAY 2023 - APRIL 2024"}]
[true,null,{"$f":"Configuration!B2","v":"ANNEX V OF THE FRAMEWORK PARTNERSHIP AGREEMENT"}]
[null,null,{"$f":"Configuration!B3","v":"ANNEX II OF THE SPECIFIC GRANT AGREEMENT"}]
[null,null,{"$f":"Configuration!B4","v":"FINANCING PLAN AND COSTS OF THE SURVEYS"}]
[null,null,{"$f":"Configuration!B5","v":"(see Framework partnership agreement: Article II.19 on Eligible costs)"}]
[null,null,{"$f":"Configuration!B7","v":"ECFIN/XXX/2023/000000"}]
[null,null,null,"INSTITUTION:",{"$f":"'Guidance BS'!B10","v":"Country"},{"$f":"'Guidance BS'!B12","v":"Acronym institution"}]
[null,null,null,"SURVEYS:","Retail Trade"]
{"$rows_left_out":59}
{"sheet":"Services","index":11,"n_rows":66,"n_cols":13,"rows_kept":66,"cut":false,"hidden":false,"merged":[[65,4,65,7],[65,9,65,11],[56,3,56,4],[57,3,57,4],[58,3,58,4],[59,3,59,4],[60,3,60,4],[62,3,62,7],[62,9,62,11],[63,4,63,7],[63,9,63,11],[55,3,55,4],[36,9,36,11],[42,4,42,7],[45,4,45,7],[45,9,45,11],[46,3,46,8],[48,9,48,11],[49,3,49,4],[51,3,51,4],[53,3,53,4],[54,3,54,4],[46,9,46,11],[30,5,30,7],[30,9,30,11],[32,5,32,7],[32,9,32,11],[34,5,34,7],[34,9,34,11],[24,5,24,7],[24,9,24,11],[26,5,26,7],[26,9,26,11],[28,5,28,7],[28,9,28,11],[23,20,23,23],[18,3,18,4],[18,5,18,8],[18,9,18,12],[19,3,20,3],[19,4,19,7],[19,9,19,11],[20,4,20,7],[20,9,20,11],[21,4,21,7],[21,9,21,11],[23,5,23,7],[23,9,23,11],[23,15,23,19],[14,4,14,7],[14,9,14,11],[15,4,15,7],[15,9,15,11],[16,4,16,7],[16,9,16,11],[11,4,11,7],[11,9,11,11],[12,4,12,7],[12,9,12,11],[13,4,13,7],[13,9,13,11],[8,5,8,8],[8,9,8,12],[9,4,9,7],[9,9,9,11],[10,4,10,7],[10,9,10,11],[5,2,5,12],[0,2,0,12],[1,2,1,12],[2,2,2,12],[3,2,3,12],[4,2,4,12]]}
[null,null,{"$f":"Configuration!B1","v":"BUDGET AND FINAL FINANCIAL STATEMENT FOR GRANT AGREEMENT PERIOD MAY 2023 - APRIL 2024"}]
[false,null,{"$f":"Configuration!B2","v":"ANNEX V OF THE FRAMEWORK PARTNERSHIP AGREEMENT"}]
[null,null,{"$f":"Configuration!B3","v":"ANNEX II OF THE SPECIFIC GRANT AGREEMENT"}]
[null,null,{"$f":"Configuration!B4","v":"FINANCING PLAN AND COSTS OF THE SURVEYS"}]
[null,null,{"$f":"Configuration!B5","v":"(see Framework partnership agreement: Article II.19 on Eligible costs)"}]
[null,null,{"$f":"Configuration!B7","v":"ECFIN/XXX/2023/000000"}]
[null,null,null,"INSTITUTION:",{"$f":"'Guidance BS'!B10","v":"Country"},{"$f":"'Guidance BS'!B12","v":"Acronym institution"}]
[null,null,null,"SURVEYS:","Services"]
{"$rows_left_out":59}
{"sheet":"Total","index":12,"n_rows":39,"n_cols":8,"rows_kept":39,"cut":false,"hidden":false,"merged":[[37,3,37,6],[38,3,38,6],[32,7,35,10],[7,4,7,5],[18,3,19,3],[0,2,0,6],[1,2,1,6],[3,2,3,6],[4,2,4,6],[6,4,6,5],[5,2,5,6],[2,2,2,6]]}
[null,null,{"$f":"Configuration!B1","v":"BUDGET AND FINAL FINANCIAL STATEMENT FOR GRANT AGREEMENT PERIOD MAY 2023 - APRIL 2024"}]
[null,null,{"$f":"Configuration!B2","v":"ANNEX V OF THE FRAMEWORK PARTNERSHIP AGREEMENT"}]
[null,null,{"$f":"Configuration!B3","v":"ANNEX II OF THE SPECIFIC GRANT AGREEMENT"}]
[null,null,{"$f":"Configuration!B4","v":"FINANCING PLAN AND COSTS OF THE SURVEYS"}]
[null,null,{"$f":"Configuration!B5","v":"(see Framework partnership agreement: Article II.19 on Eligible costs)"}]
[null,null,{"$f":"Configuration!B7","v":"ECFIN/XXX/2023/000000"}]
[null,null,"INSTITUTION:",{"$f":"'Guidance BS'!B10","v":"Country"},{"$f":"'Guidance BS'!B12","v":"Acronym institution"}]
["",null,"SURVEY(S):",null,{"$f":"IF(Consumer!I10>0,Consumer!E8,\"\") & IF(Construction!I10>0,\"  \" & Construction!E8,\"\") & IF(Industry!I10>0,\"  \" & Industry!E8,\"\") & IF('Retail Trade'!I10>0, \"  \" & 'Retail Trade'!E8,\"\")& IF(Services!I10>0,\"  \" & Services!E8,\"\")","v":""}]
{"$rows_left_out":32}
{"sheet":"Sheet1","index":13,"n_rows":27,"n_cols":4,"rows_kept":27,"cut":false,"hidden":true,"merged":[]}
["TESTS:",null,null,"Questions / comments"]
["BCS Tools","SUBCONTRACTING SHEET"]
[]
[null,"Add a subcontracting sheet","ok up to 7"]
[null,"delete a subcontracting sheet","ok"]
[null,"delete the unique subcontracting sheet not possible?","ok"]
[null,"delete a survey sheet not possible?","ok"]
[]
{"$rows_left_out":20}
{"sheet":"Calculation Methodology BS","index":14,"n_rows":34,"n_cols":3,"rows_kept":34,"cut":false,"hidden":false,"merged":[[0,0,0,2],[26,0,26,2],[28,0,28,2],[7,0,7,2],[11,0,11,2],[15,0,15,2],[23,0,23,2],[32,0,32,2],[6,1,6,2],[10,1,10,2],[14,1,14,2],[16,1,16,2],[13,0,13,2],[18,1,18,2],[19,0,19,2],[33,1,33,2],[20,1,20,2],[22,1,22,2],[34,0,34,2],[1,1,1,2],[3,1,3,2],[17,0,17,2],[21,0,21,2],[29,0,29,2],[25,1,25,2],[27,1,27,2],[30,1,30,2],[31,0,31,2],[8,1,8,2],[9,0,9,2],[12,1,12,2]]}
["INFORMATION ON THE METHODOLOGY APPLIED TO\nESTIMATE THE COSTS FOR THE SURVEY PROGRAMME "]
["CT",{"$f":"'Guidance BS'!B12","v":"Acronym institution"}]
["SURVEY METHODOLOGY:"]
["1.","Please indicate the survey methodology that you intend to apply to implement the action. Please precise which methodology will be applied for which survey."]
[null,"F2F/CAPI\nTel./CATI\nonline/CAWI\nPaper/Post \nPaper/FAX \nother (specify)","Please precise which methodology will be applied for which survey."]
["STAFF COSTS:"]
["2.","Average salary rates: \nPlease explain the methodology you used to calculate the average salary rates."]
[]
{"$rows_left_out":27}
{"sheet":"Calculation Methodology FFS","index":15,"n_rows":26,"n_cols":3,"rows_kept":26,"cut":false,"hidden":true,"merged":[[24,0,24,2],[26,0,26,2],[9,0,9,2],[13,0,13,2],[15,0,15,2],[21,0,21,2],[23,0,23,2],[22,1,22,2],[25,1,25,2],[16,0,16,2],[0,0,0,2],[18,0,18,2],[20,0,20,2],[7,0,7,2],[3,1,3,2],[1,1,1,2],[6,1,6,2],[8,1,8,2],[12,1,12,2],[14,1,14,2],[17,1,17,2],[19,1,19,2],[10,1,10,2],[11,0,11,2]]}
["INFORMATION ON THE METHODOLOGY APPLIED TO CALCULATE \nTHE INCURRED COSTS RELATED TO THE SURVEY PROGRAMME "]
["CT",{"$f":"'Guidance BS'!B12","v":"Acronym institution"}]
["SURVEY METHODOLOGY:"]
["1.","Please indicate the survey methodologies that were applied during the implementation period. Please precise which methodology was applied for which survey."]
[null,"F2F/CAPI\nTel./CATI\nonline/CAWI\nPaper/Post \nPaper/FAX \nother (specify)","Please precise which methodology will be applied for which survey."]
["STAFF COSTS:"]
["2.","Number of working days allocated to the survey-related costs: \nHow do you calculate the number of days allocated to the survey programme (do you use a time-recording system, timesheets, a sharing key per survey,…)? "]
[]
{"$rows_left_out":19}
{"sheet":"Calculation Overview","index":16,"n_rows":44,"n_cols":21,"rows_kept":44,"cut":false,"hidden":true,"merged":[[36,2,36,14],[33,1,33,20],[1,15,1,20],[0,2,0,20],[1,2,1,7],[1,8,1,13]]}
[null,"ECFIN/000/2020/000000","Overview Budget & Final Financial Statement - Calculation of eligible costs"]
[null,null,"BUDGET",null,null,null,null,null,"FINAL",null,null,null,null,null,null,"FINAL ELIGIBLE"]
[null,null,"Consumer","Construction","Industry","Retail trade","Services","Total","Consumer","Construction","Industry","Retail trade","Services","Total","CTRL ADM COSTS","Consumer","Construction","Industry","Retail trade","Services","Total"]
[null,"Staff Costs ",{"$f":"C5+C11+C12+C13+C14","v":0},{"$f":"D5+D11+D12+D13+D14","v":0},0,0,0,{"$f":"H5+H11+H12+H13+H14","v":0},{"$f":"I5+I11+I12+I13+I14","v":0},{"$f":"J5+J11+J12+J13+J14","v":0},0,0,0,{"$f":"N5+N11+N12+N13+N14","v":0},null,{"$f":"P5+P11+P12+P13+P14","v":0},{"$f":"Q5+Q11+Q12+Q13+Q14","v":0},0,0,0,0]
["I.I","Permanent staff",{"$f":"SUM(C6:C10)","v":0},{"$f":"SUM(D6:D10)","v":0},0,0,0,0,0,{"$f":"SUM(J6:J10)","v":0},0,0,0,{"$f":"SUM(N6:N10)","v":0},null,{"$f":"SUM(P6:P10)","v":0},{"$f":"SUM(Q6:Q10)","v":0},0,0,0,0]
[null,"Managers",{"$f":"Consumer!I25","v":0},{"$f":"Construction!I25","v":0},{"$f":"Industry!I25","v":0},{"$f":"'Retail Trade'!I25","v":0},{"$f":"Services!I25","v":0},{"$f":"SUM(C6:G6)","v":0},{"$f":"Consumer!M25","v":0},{"$f":"Construction!M25","v":0},{"$f":"Industry!M25","v":0},{"$f":"'Retail Trade'!M25","v":0},{"$f":"Services!M25","v":0},{"$f":"SUM(I6:M6)","v":0},null,{"$f":"+I6","v":0},{"$f":"+J6","v":0},{"$f":"+K6","v":0},{"$f":"+L6","v":0},{"$f":"+M6","v":0},{"$f":"SUM(P6:T6)","v":0}]
[null,"Researchers",{"$f":"Consumer!I27","v":0},{"$f":"Construction!I27","v":0},{"$f":"Industry!I27","v":0},{"$f":"'Retail Trade'!I27","v":0},{"$f":"Services!I27","v":0},{"$f":"SUM(C7:G7)","v":0},{"$f":"Consumer!M27","v":0},{"$f":"Construction!M27","v":0},{"$f":"Industry!M27","v":0},{"$f":"'Retail Trade'!M27","v":0},{"$f":"Services!M27","v":0},{"$f":"SUM(I7:M7)","v":0},null,{"$f":"+I7","v":0},{"$f":"+J7","v":0},0,0,0,{"$f":"SUM(P7:T7)","v":0}]
[null,"Interviewers",{"$f":"Consumer!I29","v":0},{"$f":"Construction!I29","v":0},{"$f":"Industry!I29","v":0},{"$f":"'Retail Trade'!I29","v":0},{"$f":"Services!I29","v":0},0,{"$f":"Consumer!M29","v":0},{"$f":"Construction!M29","v":0},{"$f":"Industry!M29","v":0},{"$f":"'Retail Trade'!M29","v":0},{"$f":"Services!M29","v":0},0,null,0,0,0,0,0,0]
{"$rows_left_out":37}
{"sheet":"Calculation Balance","index":17,"n_rows":31,"n_cols":4,"rows_kept":31,"cut":false,"hidden":true,"merged":[[3,4,3,6],[4,0,4,3],[5,0,5,3],[0,0,0,3],[1,0,1,3],[2,0,2,3],[3,0,3,3]]}
[{"$f":"[0]!HeadingLine1","v":"BUDGET AND FINAL FINANCIAL STATEMENT FOR GRANT AGREEMENT PERIOD MAY 2023 - APRIL 2024"}]
["CALCULATION SHEET"]
[{"$f":"[0]!HeadingLine4","v":"FINANCING PLAN AND COSTS OF THE SURVEYS"}]
[{"$f":"[0]!HeadingLine5","v":"(see Framework partnership agreement: Article II.19 on Eligible costs)"}]
[{"$f":"Total!C6","v":"ECFIN/XXX/2023/000000"}]
[""]
[null,"BUDGET ESTIMATION","FINAL FINANCIAL STATEMENT","APPROVED ELIGIBLE  COSTS             "]
["Staff Costs",{"$f":"B9+B10+B11+B12+B13","v":0},{"$f":"C9+C10+C11+C12+C13","v":0},{"$f":"D9+D10+D11+D12+D13","v":0}]
{"$rows_left_out":23}